{"text_format":"1","workbook":"xlsx","n_sheets":6,"sheets":["R６年度　平均正答率入力シート","R6年度　質問紙入力シート","R6年度　結果分析表","計算根拠・グラフ参照用シート","行政番号と学校名","学校番号"],"not_rendered":{"charts":1,"images":0,"macros":1,"external_links":0,"defined_names":2,"comments":0,"pivot_tables":0},"unopened":[],"bounds":{"document_bytes":16777216,"sheet_cells":100000,"rows_first":2000,"rows_last":500,"rows_between":2000,"halvings":0,"cell_chars":16384,"cell_head_chars":4096},"cells_cut":0,"cells_raw":0,"read":"whole","date_system":"1900"}

{"sheet":"R６年度　平均正答率入力シート","index":0,"n_rows":5,"n_cols":4,"rows_kept":5,"cut":false,"hidden":false,"merged":[[0,2,0,3]]}
["行政番号（3ケタ）",204,{"$f":"VLOOKUP(B1,学校番号!A67:B98,2)","v":"江戸川区立松江第二中学校"}]
[null,"※↑行政番号を入力して下さい。これ以降の学校名は自動で表記されます。"]
["領域名","全国平均正答率（％）\n（Ａ）","本校平均正答率（％）","（Ａ）を１とした場合の本校の様子"]
["国語",58.1,54,{"$f":"C4/B4","v":0.92943201376936313}]
["数学",52.5,53,{"$f":"C5/B5","v":1.0095238095238095}]

{"sheet":"R6年度　質問紙入力シート","index":1,"n_rows":27,"n_cols":12,"rows_kept":27,"cut":false,"hidden":false,"merged":[[15,10,18,10],[15,11,18,11],[12,6,14,6],[15,6,18,6],[19,0,22,0],[19,6,22,6],[19,10,22,10],[19,11,22,11],[0,10,1,10],[0,11,1,11],[2,0,5,0],[2,6,5,6],[2,10,5,10],[2,11,5,11],[0,0,1,0],[0,1,1,1],[0,2,1,2],[0,3,0,4],[0,6,1,6],[0,7,0,8],[23,0,26,0],[23,6,26,6],[23,10,26,10],[23,11,26,11],[6,0,8,0],[6,6,8,6],[6,10,8,10],[6,11,8,11],[9,0,11,0],[9,6,11,6],[9,10,11,10],[9,11,11,11],[12,0,14,0],[15,0,18,0],[12,10,14,10],[12,11,14,11]]}
["領域名","問番号","質問内容","全国肯定的回答",null,"全国　\n肯定的回答（小計）","全国\n肯定的回答（合計）\n（Ｂ）","本校肯定的回答",null,"本校\n肯定的回答（小計）","本校\n肯定的回答（合計）","（Ｂ）を１とした場合の本校の様子"]
[null,null,null,1,2,"1+2",null,1,2,"1+2"]
["基本的生活習慣","（1）","朝食を毎日食べていますか",79.099999999999994,12.1,{"$f":"D3+E3","v":91.199999999999989},{"$f":"SUM(F3:F6)","v":341.09999999999997},74.7,14.5,{"$f":"H3+I3","v":89.2},{"$f":"SUM(J3:J6)","v":339.70000000000005},{"$f":"K3/G3","v":0.99589563177953699}]
[null,"（2）","毎日、同じくらいの時刻に寝ていますか",34.9,45.8,80.699999999999989,null,32.5,43.4,{"$f":"H4+I4","v":75.900000000000006}]
[null,"（3）","毎日、同じくらいの時刻に起きていますか",55.3,37.200000000000003,92.5,null,59,32.5,{"$f":"H5+I5","v":91.5}]
[null,"(8)","健康にすごすために、授業で学習したことや保健室の先生などから教えられたことを、普段の生活に役立てていますか",28.4,48.3,76.699999999999989,null,36.1,47,83.1]
["自己有用感","(9)","自分には、よいところがあると思いますか",40.4,42.9,83.3,{"$f":"SUM(F7:F9)","v":240},45.8,37.299999999999997,83.1,{"$f":"SUM(J7:J9)","v":237.29999999999998},{"$f":"K7/G7","v":0.98874999999999991}]
[null,"(10)","先生は、あなたのよいところを認めてくれていると思いますか",44.2,46.2,90.4,null,43.4,48.2,91.6]
[null,"(11)","将来の夢や目標を持っていますか",36.1,30.2,66.3,null,33.700000000000003,28.9,62.6]
["規範意識","(12)","人が困っているときは、進んで助けていますか",38.299999999999997,51.8,90.1,{"$f":"SUM(F10:F12)","v":281},56.6,39.799999999999997,96.4,{"$f":"SUM(J10:J12)","v":291.60000000000002},{"$f":"K10/G10","v":1.0377224199288257}]
[null,"(13)","いじめは、どんな理由があってもいけないことだと思いますか",77.5,18.2,{"$f":"D11+E11","v":95.7},null,79.5,19.3,98.8]
[null,"(15)","人の役に立つ人間になりたいと思いますか",68.599999999999994,26.6,{"$f":"D12+E12","v":95.199999999999989},null,74.7,21.7,96.4]
["主体的な学び","(29)","１、２年生のときに受けた授業で、自分の考えを発表する機会では、自分の考えがうまく伝わるよう、資料や文章、話の組立てなどを工夫して発表していましたか",22.2,42.6,64.8,{"$f":"SUM(F13:F15)","v":220.5},28.9,43.4,{"$f":"H13+I13","v":72.3},{"$f":"SUM(J13:J15)","v":233.7},{"$f":"K13/G13","v":1.0598639455782313}]
[null,"(30)","１、２年生のときに受けた授業では、課題の解決に向けて、自分で考え、自分から取り組んでいましたか",27.2,53.1,80.3,null,30.1,53,{"$f":"H14+I14","v":83.1}]
[null,"(31)","１、２年生のときに受けた授業では、各教科などで学んだことを生かしながら、自分の考えをまとめる活動を行っていましたか",24.7,50.7,{"$f":"D15+E15","v":75.400000000000006},null,31.3,47,{"$f":"H15+I15","v":78.3}]
["対話的な学び","(33)","学級の生徒との間で話し合う活動を通じて、自分の考えを深めたり、新たな考え方に気付いたりすることができていますか",36.4,49.7,86.1,{"$f":"SUM(F16:F19)","v":344.69999999999993},41,45.8,86.8,{"$f":"SUM(J16:J19)","v":344.59999999999997},{"$f":"K16/G16","v":0.99970989266028443}]
[null,"(39)","あなたの学級では、学級生活をよりよくするために学級活動で話し合い、互いの意見のよさを生かして解決方法を決めていますか",35.5,50.8,86.3,null,34.9,54.2,89.1]
[null,"(40)","学級活動における学級での話合いを生かして、今、自分が努力すべきことを決めて取り組んでいますか",30.2,50.4,{"$f":"D18+E18","v":80.599999999999994},null,32.5,43.4,75.900000000000006]
[null,"(41)","道徳の授業では、自分の考えを深めたり、学級やグループで話し合ったりする活動に取り組んでいますか",49.8,41.9,{"$f":"D19+E19","v":91.699999999999989},null,47,45.8,92.8]
["国語への関心","(42)","国語の勉強は好きですか",24.4,39.9,64.3,{"$f":"SUM(F20:F23)","v":331.5},18.100000000000001,42.2,60.300000000000004,{"$f":"SUM(J20:J23)","v":341},{"$f":"K20/G20","v":1.0286576168929109}]
[null,"(43)","国語の勉強は大切だと思いますか",62.4,31.5,93.9,null,66.3,30.1,96.4]
[null,"(44)","国語の授業の内容はよく分かりますか",32,50.7,82.7,null,19.3,69.900000000000006,89.2]
[null,"(45)","国語の授業で学習したことは、将来、社会に出たときに役に立つと思いますか",52.3,38.299999999999997,90.6,null,61.4,33.700000000000003,95.1]
["数学への関心","(50)","数学の勉強は好きですか",29.4,27.8,57.2,{"$f":"SUM(F24:F27)","v":298.59999999999997},22.9,41,63.9,{"$f":"SUM(J24:J27)","v":303.60000000000002},{"$f":"K24/G24","v":1.0167448091091764}]
[null,"(51)","数学の勉強は大切だと思いますか",52.8,34.4,87.199999999999989,null,54.2,32.5,86.7]
[null,"(52)","数学の授業の内容はよく分かりますか",35.1,40.6,75.7,null,38.6,37.299999999999997,75.900000000000006]
[null,"(53)","数学の授業で学習したことは、将来、社会に出たときに役に立つと思いますか",40,38.5,78.5,null,36.1,41,77.099999999999994]

{"sheet":"R6年度　結果分析表","index":2,"n_rows":39,"n_cols":16,"rows_kept":39,"cut":false,"hidden":false,"merged":[[38,14,44,18],[19,14,35,18],[5,14,16,18],[38,1,44,12]]}
[]
[null,"令和６年度 全国学力・学習状況調査結果における課題分析表(中学校）",null,null,null,null,null,null,null,null,null,null,null,null,null,{"$f":"VLOOKUP('R６年度　平均正答率入力シート'!B1,学校番号!A67:B98,2)","v":"江戸川区立松江第二中学校"}]
[]
[]
[null,"●各領域における、全国平均正答率及び、全国の肯定的回答合計値を基準とした場合の、本校の様子。",null,null,null,null,null,null,null,null,null,null,null,null,"《現状把握》"]
[null,null,null,null,null,null,null,null,null,null,null,null,null,null,"国語は話す聞くこと-8.2、書くこと-2.6、読むこと-4.5だった。数学は数と式-2.9、図形-1.3、関数-2.0、データの活用+1.5だった。国語、数学は全体的に全国の平均を下回っているが、数学出題分野によっては全国の平均を上回ることができた。"]
[]
[]
[]
[]
[]
[]
[]
[]
[]
[]
[]
[]
[null,null,null,null,null,null,null,null,null,null,null,null,null,null,"《授業改善のポイント》"]
[null,null,null,null,null,null,null,null,null,null,null,null,null,null,"（国語）\n・聞くこと小テストを実施しており、今後も継続していく。\n・読み取る力を伸ばすために、特に説明的文章の読解の力をつけていく。そして、それを表現すること（話し力、書く力）に応用させるように対話の授業の回数を増やしていく。\n（数学）\n・図形の領域では、模型やICTを活用して、実物に触ることや視覚的に図形を学び、理解を深める。また、図形の面積や角度を求める計算問題に対応できるように計算力をつけていく。また、定期的に計算コンテストや図形コンテストなどを実施し、領域別による正答率格差を改善する。\n・全学年、授業開始5分で基礎計算テストを行い基礎計算力の向上を図る。\n"]
[]
[]
[]
[]
[]
[]
[]
[]
[]
[]
[]
[]
[]
[]
[]
[]
[]
[null,"《チャートの特徴》",null,null,null,null,null,null,null,null,null,null,null,null,"《家庭・地域への働きかけ》"]
[null,"全国平均正答率と比較すると、国語-4.1％、数学＋0.5％となり、国語は全国平均を下回るが、数学は全国平均を上回る結果になった。さらに、全教科とも教科への関心が高い（全国比で国語1.03倍、数学1.27倍）。数学のその高さと正答率が比例しているものと考えられる。また主体的な学びのポイントが本校は高く、全国平均の１．０５倍となっており、数学の正答率向上にもつながっていると言える。",null,null,null,null,null,null,null,null,null,null,null,null,"授業の振り返りシートや定期考査の学習計画表などを通して学習習慣の確立を図る。進路に関する情報を積極的に発信し、関心を高めるよう努める。放課後補習教室等を活性化させ、学習内容の定着により一層力を入れる。"]

{"sheet":"計算根拠・グラフ参照用シート","index":3,"n_rows":20,"n_cols":5,"rows_kept":20,"cut":false,"hidden":true,"merged":[]}
["領域名","全国の値を１とした場合の本校の様子",null,"領域名","全国の値を１とした場合の本校の様子"]
["基本的生活習慣",{"$f":"'R6年度　質問紙入力シート'!L3","v":0.99589563177953699},null,"国語",{"$f":"'R６年度　平均正答率入力シート'!D4","v":0.92943201376936313}]
["自己有用感",{"$f":"'R6年度　質問紙入力シート'!L7","v":0.98874999999999991},null,"数学",{"$f":"'R６年度　平均正答率入力シート'!D5","v":1.0095238095238095}]
["規範意識",{"$f":"'R6年度　質問紙入力シート'!L10","v":1.0377224199288257}]
["主体的な学び",{"$f":"'R6年度　質問紙入力シート'!L13","v":1.0598639455782313}]
["対話的な学び",{"$f":"'R6年度　質問紙入力シート'!L16","v":0.99970989266028443}]
["国語への関心",{"$f":"'R6年度　質問紙入力シート'!L20","v":1.0286576168929109}]
["数学への関心",{"$f":"'R6年度　質問紙入力シート'!L24","v":1.0167448091091764}]
[]
["グラフ参照用一覧"]
["領域名","全国","本校"]
["国語平均正答率",1,{"$f":"E2","v":0.92943201376936313}]
["数学平均正答率",1,{"$f":"E3","v":1.0095238095238095}]
["基本的生活習慣",1,{"$f":"B2","v":0.99589563177953699}]
["自己有用感",1,{"$f":"B3","v":0.98874999999999991}]
["規範意識",1,1.0377224199288257]
["主体的な学び",1,1.0598639455782313]
["対話的な学び",1,0.99970989266028443]
["国語への関心",1,1.0286576168929109]
["数学への関心",1,1.0167448091091764]

{"sheet":"行政番号と学校名","index":4,"n_rows":98,"n_cols":2,"rows_kept":98,"cut":false,"hidden":true,"merged":[]}
[101,"江戸川区立小松川小学校"]
[102,"江戸川区立小松川第二小学校"]
[103,"江戸川区立平井小学校"]
[104,"江戸川区立平井西小学校"]
[105,"江戸川区立平井東小学校"]
[106,"江戸川区立平井南小学校"]
[107,"江戸川区立松江小学校"]
[108,"江戸川区立西一之江小学校"]
[109,"江戸川区立西小松川小学校"]
[110,"江戸川区立大杉小学校"]
[111,"江戸川区立大杉第二小学校"]
[112,"江戸川区立第三松江小学校"]
[113,"江戸川区立大杉東小学校"]
[114,"江戸川区立東小松川小学校"]
[115,"江戸川区立船堀小学校"]
[116,"江戸川区立船堀第二小学校"]
[117,"江戸川区立葛西小学校"]
[118,"江戸川区立二之江小学校"]
[119,"江戸川区立二之江第二小学校"]
[120,"江戸川区立第二葛西小学校"]
[121,"江戸川区立第三葛西小学校"]
[122,"江戸川区立第四葛西小学校"]
[123,"江戸川区立第五葛西小学校"]
[124,"江戸川区立第六葛西小学校"]
[125,"江戸川区立第七葛西小学校"]
[126,"江戸川区立南葛西小学校"]
[127,"江戸川区立南葛西第二小学校"]
[128,"江戸川区立南葛西第三小学校"]
[129,"江戸川区立西葛西小学校"]
[130,"江戸川区立新田小学校"]
[131,"江戸川区立宇喜田小学校"]
[132,"江戸川区立清新第一小学校"]
[133,"江戸川区立清新ふたば小学校"]
[134,"江戸川区立臨海小学校"]
[135,"江戸川区立東葛西小学校"]
[136,"江戸川区立瑞江小学校"]
[137,"江戸川区立春江小学校"]
[138,"江戸川区立新堀小学校"]
[139,"江戸川区立下鎌田小学校"]
[140,"江戸川区立下鎌田東小学校"]
[141,"江戸川区立江戸川小学校"]
[142,"江戸川区立一之江小学校"]
[143,"江戸川区立一之江第二小学校"]
[144,"江戸川区立鹿本小学校"]
[145,"江戸川区立鹿骨小学校"]
[146,"江戸川区立鹿骨東小学校"]
[147,"江戸川区立松本小学校"]
[148,"江戸川区立本一色小学校"]
[149,"江戸川区立篠崎小学校"]
[150,"江戸川区立篠崎第二小学校"]
[151,"江戸川区立篠崎第三小学校"]
[152,"江戸川区立篠崎第四小学校"]
[153,"江戸川区立篠崎第五小学校"]
[154,"江戸川区立南篠崎小学校"]
[155,"江戸川区立鎌田小学校"]
[156,"江戸川区立小岩小学校"]
[157,"江戸川区立東小岩小学校"]
[158,"江戸川区立下小岩小学校"]
[159,"江戸川区立上小岩小学校"]
[160,"江戸川区立上小岩第二小学校"]
[161,"江戸川区立西小岩小学校"]
[162,"江戸川区立上一色南小学校"]
[163,"江戸川区立南小岩小学校"]
[164,"江戸川区立南小岩第二小学校"]
[165,"江戸川区立中小岩小学校"]
[166,"江戸川区立北小岩小学校"]
[201,"江戸川区立小松川中学校"]
[202,"江戸川区立小松川第二中学校"]
[203,"江戸川区立松江第一中学校"]
[204,"江戸川区立松江第二中学校"]
[205,"江戸川区立松江第三中学校"]
[206,"江戸川区立松江第四中学校"]
[207,"江戸川区立松江第五中学校"]
[208,"江戸川区立松江第六中学校"]
[209,"江戸川区立二之江中学校"]
[210,"江戸川区立葛西中学校"]
[211,"江戸川区立葛西第二中学校"]
[212,"江戸川区立葛西第三中学校"]
[213,"江戸川区立南葛西中学校"]
[214,"江戸川区立南葛西第二中学校"]
[215,"江戸川区立西葛西中学校"]
[216,"江戸川区立東葛西中学校"]
[217,"江戸川区立清新第一中学校"]
[218,"江戸川区立清新第二中学校"]
[219,"江戸川区立瑞江中学校"]
[220,"江戸川区立瑞江第二中学校"]
[221,"江戸川区立瑞江第三中学校"]
[222,"江戸川区立春江中学校"]
[223,"江戸川区立鹿本中学校"]
[224,"江戸川区立鹿骨中学校"]
[225,"江戸川区立篠崎中学校"]
[226,"江戸川区立篠崎第二中学校"]
[227,"江戸川区立小岩第一中学校"]
[228,"江戸川区立小岩第二中学校"]
[229,"江戸川区立小岩第三中学校"]
[230,"江戸川区立小岩第四中学校"]
[231,"江戸川区立小岩第五中学校"]
[232,"江戸川区立上一色中学校"]

{"sheet":"学校番号","index":5,"n_rows":98,"n_cols":2,"rows_kept":98,"cut":false,"hidden":true,"merged":[]}
[101,"江戸川区立小松川小学校"]
[102,"江戸川区立小松川第二小学校"]
[103,"江戸川区立平井小学校"]
[104,"江戸川区立平井西小学校"]
[105,"江戸川区立平井東小学校"]
[106,"江戸川区立平井南小学校"]
[107,"江戸川区立松江小学校"]
[108,"江戸川区立西一之江小学校"]
[109,"江戸川区立西小松川小学校"]
[110,"江戸川区立大杉小学校"]
[111,"江戸川区立大杉第二小学校"]
[112,"江戸川区立第三松江小学校"]
[113,"江戸川区立大杉東小学校"]
[114,"江戸川区立東小松川小学校"]
[115,"江戸川区立船堀小学校"]
[116,"江戸川区立船堀第二小学校"]
[117,"江戸川区立葛西小学校"]
[118,"江戸川区立二之江小学校"]
[119,"江戸川区立二之江第二小学校"]
[120,"江戸川区立第二葛西小学校"]
[121,"江戸川区立第三葛西小学校"]
[122,"江戸川区立第四葛西小学校"]
[123,"江戸川区立第五葛西小学校"]
[124,"江戸川区立第六葛西小学校"]
[125,"江戸川区立第七葛西小学校"]
[126,"江戸川区立南葛西小学校"]
[127,"江戸川区立南葛西第二小学校"]
[128,"江戸川区立南葛西第三小学校"]
[129,"江戸川区立西葛西小学校"]
[130,"江戸川区立新田小学校"]
[131,"江戸川区立宇喜田小学校"]
[132,"江戸川区立清新第一小学校"]
[133,"江戸川区立清新ふたば小学校"]
[134,"江戸川区立臨海小学校"]
[135,"江戸川区立東葛西小学校"]
[136,"江戸川区立瑞江小学校"]
[137,"江戸川区立春江小学校"]
[138,"江戸川区立新堀小学校"]
[139,"江戸川区立下鎌田小学校"]
[140,"江戸川区立下鎌田東小学校"]
[141,"江戸川区立江戸川小学校"]
[142,"江戸川区立一之江小学校"]
[143,"江戸川区立一之江第二小学校"]
[144,"江戸川区立鹿本小学校"]
[145,"江戸川区立鹿骨小学校"]
[146,"江戸川区立鹿骨東小学校"]
[147,"江戸川区立松本小学校"]
[148,"江戸川区立本一色小学校"]
[149,"江戸川区立篠崎小学校"]
[150,"江戸川区立篠崎第二小学校"]
[151,"江戸川区立篠崎第三小学校"]
[152,"江戸川区立篠崎第四小学校"]
[153,"江戸川区立篠崎第五小学校"]
[154,"江戸川区立南篠崎小学校"]
[155,"江戸川区立鎌田小学校"]
[156,"江戸川区立小岩小学校"]
[157,"江戸川区立東小岩小学校"]
[158,"江戸川区立下小岩小学校"]
[159,"江戸川区立上小岩小学校"]
[160,"江戸川区立上小岩第二小学校"]
[161,"江戸川区立西小岩小学校"]
[162,"江戸川区立上一色南小学校"]
[163,"江戸川区立南小岩小学校"]
[164,"江戸川区立南小岩第二小学校"]
[165,"江戸川区立中小岩小学校"]
[166,"江戸川区立北小岩小学校"]
[201,"江戸川区立小松川中学校"]
[202,"江戸川区立小松川第二中学校"]
[203,"江戸川区立松江第一中学校"]
[204,"江戸川区立松江第二中学校"]
[205,"江戸川区立松江第三中学校"]
[206,"江戸川区立松江第四中学校"]
[207,"江戸川区立松江第五中学校"]
[208,"江戸川区立松江第六中学校"]
[209,"江戸川区立二之江中学校"]
[210,"江戸川区立葛西中学校"]
[211,"江戸川区立葛西第二中学校"]
[212,"江戸川区立葛西第三中学校"]
[213,"江戸川区立南葛西中学校"]
[214,"江戸川区立南葛西第二中学校"]
[215,"江戸川区立西葛西中学校"]
[216,"江戸川区立東葛西中学校"]
[217,"江戸川区立清新第一中学校"]
[218,"江戸川区立清新第二中学校"]
[219,"江戸川区立瑞江中学校"]
[220,"江戸川区立瑞江第二中学校"]
[221,"江戸川区立瑞江第三中学校"]
[222,"江戸川区立春江中学校"]
[223,"江戸川区立鹿本中学校"]
[224,"江戸川区立鹿骨中学校"]
[225,"江戸川区立篠崎中学校"]
[226,"江戸川区立篠崎第二中学校"]
[227,"江戸川区立小岩第一中学校"]
[228,"江戸川区立小岩第二中学校"]
[229,"江戸川区立小岩第三中学校"]
[230,"江戸川区立小岩第四中学校"]
[231,"江戸川区立小岩第五中学校"]
[232,"江戸川区立上一色中学校"]