{"text_format":"1","workbook":"xlsx","n_sheets":6,"sheets":["３年度　平均正答率入力シート","３年度　質問紙入力シート","３年度　結果分析表","計算根拠・グラフ参照用シート","行政番号と学校名","学校番号"],"not_rendered":{"charts":1,"images":0,"macros":1,"external_links":0,"defined_names":2,"comments":0,"pivot_tables":0},"unopened":[],"bounds":{"document_bytes":16777216,"sheet_cells":100000,"rows_first":2000,"rows_last":500,"rows_between":2000,"halvings":0,"cell_chars":16384,"cell_head_chars":4096},"cells_cut":0,"cells_raw":0,"read":"whole","date_system":"1900"}

{"sheet":"３年度　平均正答率入力シート","index":0,"n_rows":5,"n_cols":4,"rows_kept":5,"cut":false,"hidden":false,"merged":[[0,2,0,3]]}
["行政番号（3ケタ）",null,{"$f":"VLOOKUP(B1,学校番号!A1:B70,2)","v":{"$error":"#N/A"}}]
[null,"※↑行政番号を入力して下さい。これ以降の学校名は自動で表記されます。"]
["領域名","全国平均正答率（％）（Ａ）","本校平均正答率（％）","（Ａ）を１とした場合の本校の様子"]
["国語",64.599999999999994,67,{"$f":"C4/B4","v":1.0371517027863777}]
["数学",57.2,60,{"$f":"C5/B5","v":1.048951048951049}]

{"sheet":"３年度　質問紙入力シート","index":1,"n_rows":37,"n_cols":12,"rows_kept":37,"cut":false,"hidden":false,"merged":[[15,11,18,11],[12,11,14,11],[12,0,14,0],[15,0,18,0],[12,6,14,6],[15,6,18,6],[12,10,14,10],[15,10,18,10],[19,10,26,10],[19,11,26,11],[27,11,36,11],[27,6,36,6],[27,10,36,10],[2,0,5,0],[6,0,8,0],[27,0,36,0],[19,0,26,0],[19,6,26,6],[9,0,11,0],[9,11,11,11],[9,6,11,6],[9,10,11,10],[0,11,1,11],[2,11,5,11],[6,11,8,11],[2,10,5,10],[6,10,8,10],[2,6,5,6],[6,6,8,6],[0,0,1,0],[0,1,1,1],[0,2,1,2],[0,6,1,6],[0,10,1,10],[0,3,0,4],[0,7,0,8]]}
["領域名","問番号","質問内容","全国肯定的回答",null,"全国　\n肯定的回答（小計）","全国\n肯定的回答（合計）\n（Ｂ）","本校肯定的回答",null,"本校\n肯定的回答（小計）","本校\n肯定的回答（合計）","（Ｂ）を１とした場合の本校の様子"]
[null,null,null,1,2,"1+2",null,1,2,"1+2"]
["生活・学習習慣","（1）","朝食を毎日食べていますか",81.8,11,{"$f":"D3+E3","v":92.8},{"$f":"SUM(F3:F6)","v":333.20000000000005},108,8,{"$f":"H3+I3","v":116},{"$f":"SUM(J3:J6)","v":419},{"$f":"K3/G3","v":1.25750300120048}]
[null,"（2）","毎日、同じくらいの時刻に寝ていますか",36.299999999999997,43.5,79.8,null,44,48,{"$f":"H4+I4","v":92}]
[null,"（3）","毎日、同じくらいの時刻に起きていますか",57.6,35.1,{"$f":"D5+E5","v":92.7},null,80,39,{"$f":"H5+I5","v":119}]
[null,"（4）","携帯電話・スマートフォンの使い方について家の人と約束したことを守っていますか",30.9,37,67.900000000000006,null,49,43,92]
["自己有用感","（6）","自分には、よいところがあると思いますか",34.5,41.7,76.2,{"$f":"SUM(F7:F9)","v":229},45,54,99,{"$f":"SUM(J7:J9)","v":299},{"$f":"K7/G7","v":1.3056768558951966}]
[null,"（７）","将来の夢や目標を持っていますか",40.5,28.1,{"$f":"D8+E8","v":68.599999999999994},null,57,36,{"$f":"H8+I8","v":93}]
[null,"（8）","自分でやると決めたことは、やり遂げるようにしていますか",34.700000000000003,49.5,84.2,null,46,61,107]
["規範意識","（10）","人が困っているときは、進んで助けていますか。",41.6,46.9,88.5,{"$f":"SUM(F10:F12)","v":279.39999999999998},65,51,116,{"$f":"SUM(J10:J12)","v":358},{"$f":"K10/G10","v":1.2813171080887618}]
[null,"（11）","いじめは、どんな理由があってもいけないことだと思いますか",81.400000000000006,14.5,95.9,null,104,16,120]
[null,"（12）","人の役に立つ人間になりたいと思いますか",74.3,20.7,95,null,102,20,122]
["主体的な学び","（39）","総合的な学習の時間では、自分で課題を立てて情報を集め整理して、調べたことを発表するなどの学習活動に取り組んでいると思いますか",28.2,42,70.2,{"$f":"SUM(F13:F15)","v":225.10000000000002},31,42,73,{"$f":"SUM(J13:J15)","v":270},{"$f":"K13/G13","v":1.1994669035984007}]
[null,"（40）","あなたの学級では、学級生活をよりよくするために学級会で話し合い、互いの意見のよさを生かして解決方法を決めていますか。",28.3,45.6,73.900000000000006,null,28,63,91]
[null,"（33）","１、２年生の時に受けた授業では、課題の解決に向けて、自分で考え、自分から取り組んでいたと思いますか",33.5,47.5,81,null,63,43,106]
["対話的な学び","（37）","学級の友達との間で話し合う活動を通じて、自分の考えを深めたり、広げたりすることができていると思いますか",33.9,43.9,77.8,{"$f":"SUM(F16:F19)","v":299.89999999999998},58,47,105,{"$f":"SUM(J16:J19)","v":405},{"$f":"K16/G16","v":1.3504501500500168}]
[null,"（40）","あなたの学級では、学級生活をよりよくするために学級会で話し合い、互いの意見のよさを生かして解決方法を決めていると思いますか",28.3,45.6,{"$f":"D17+E17","v":73.900000000000006},null,29,63,92]
[null,"（42）","道徳の授業では、自分の考えを深めたり、学級やグループで話し合ったりする活動に取り組んでいると思いますか",48.8,37.4,86.199999999999989,null,69,45,114]
[null,"（32）","１、２年生の時に受けた授業で、自分の考えを発表する機会では、自分の考えがうまく伝わるよう、資料や文章、話の組立てなどを工夫して発表していたと思いますか",21,41,62,null,32,62,94]
["国語への関心","（43）","国語の勉強は好きですか",23.5,37.299999999999997,60.8,{"$f":"SUM(F20:F27)","v":616},47,39,{"$f":"H20+I20","v":86},{"$f":"SUM(J20:J27)","v":847},{"$f":"K20/G20","v":1.375}]
[null,"（44）","国語の勉強は大切だと思いますか",60,31.6,91.6,null,87,29,{"$f":"H21+I21","v":116}]
[null,"（45）","国語の授業の内容はよく分かりますか",31.5,48.6,80.099999999999994,null,57,52,109]
[null,"（46）","国語の授業で学習したことは、将来、社会に出たときに役に立つと思いますか",53.7,35,88.7,null,78,39,117]
[null,"（47）","国語の授業では、言葉の特徴や使い方についての知識を理解したり使ったりしていますか。",35.5,46.3,81.8,null,59,51,110]
[null,"（48）","国語の授業では、目的に応じて、自分の考えを話したり必要に応じて質問したりしていますか。",22.7,38.6,61.3,null,55,41,96]
[null,"（49）","国語の授業は、目的に応じて、自分の考えとそれを支える理由との関係が分かるように書いたり表現を工夫して書いたりしていますか。",28.6,46,74.599999999999994,null,50,53,103]
[null,"（50）","国語の授業では、目的に応じて文章を読み、感想や考えをもったり、自分の考えを広げたりしていますか。",32.299999999999997,44.8,77.099999999999994,null,58,52,110]
["数学への関心","（52）","数学の勉強は好きですか",31.2,27.9,59.099999999999994,{"$f":"SUM(F28:F37)","v":588.9},60,20,80,{"$f":"SUM(J28:J37)","v":765},{"$f":"K28/G28","v":1.2990320937340805}]
[null,"（53）","数学の勉強は大切だと思いますか",49.3,34.799999999999997,{"$f":"D29+E29","v":84.1},null,79,27,106]
[null,"（54）","数学の授業の内容はよく分かりますか",35.6,39,74.599999999999994,null,57,40,97]
[null,"（55）","数学の授業で学習したことは、将来、社会に出たときに役に立つと思いますか",37.799999999999997,36.799999999999997,{"$f":"D31+E31","v":74.599999999999994},null,48,44,{"$f":"H31+I31","v":92}]
[null,"（56）","数学の授業で学習したことを、普段の生活の中で活用できないか考えますか",19.7,30.9,50.599999999999994,null,32,43,75]
[null,"（57）","数学の問題の解き方が分からないときは、あきらめずにいろいろな方法を考えますか",38.299999999999997,37.5,75.8,null,61,35,96]
[null,"（58）","数学の授業で公式や決まりを習うとき、そのわけを理解するようにしていますか",45.6,37.9,83.5,null,68,39,107]
[null,"（59）","数学の授業で問題の解き方や考え方が分かるようにノートに書いていますか",58,28.6,86.6,null,85,27,112]
[null,null,null,null,null,0,null,null,null,0]
[null,null,null,null,null,0,null,null,null,0]

{"sheet":"３年度　結果分析表","index":2,"n_rows":39,"n_cols":16,"rows_kept":39,"cut":false,"hidden":false,"merged":[[38,14,44,18],[19,14,35,18],[5,14,16,18],[38,1,44,12]]}
[]
[null,"令和３年度全国学力・学習状況調査結果における課題分析表",null,null,null,null,null,null,null,null,null,null,null,null,null,{"$f":"VLOOKUP('３年度　平均正答率入力シート'!B1,学校番号!A1:B70,2)","v":{"$error":"#N/A"}}]
[]
[]
[null,"●各領域における、全国平均正答率及び、全国の肯定的回答合計値を基準とした場合の、本校の様子。",null,null,null,null,null,null,null,null,null,null,null,null,"《現状把握》"]
[null,null,null,null,null,null,null,null,null,null,null,null,null,null,"国語\n正答率全国平均より2.4ポイント高い。正答数分布グラフでも１１問正解(上位層)が全国よりも５％高く、２問以下(下位層)が本校は０であった。\n数学\n正答率全国平均より0.8ポイント高い。全問正解と全問不正解が全国よりも高い。12問正解(上位層)が全国よりも1.2%低いなど正規分布からはずれている。\n国語・数学ともに全国平均を僅かに上回っている現状は今後も維持したい。"]
[]
[]
[]
[]
[]
[]
[]
[]
[]
[]
[]
[]
[null,null,null,null,null,null,null,null,null,null,null,null,null,null,"《授業改善のポイント》"]
[null,null,null,null,null,null,null,null,null,null,null,null,null,null,"国語については、理解や説明する内容についてはよい成果が出ている。漢字書取り等知識の学習を進めることで補なうことができる。生徒の興味関心や教科の有用性の意識も高く現状の進め方でよいと考える。\n数学については、図形については比較的良い結果が出せている。文字式について、基本的な技能の習熟を目指して進める必要がある。国語同様に教科に対する興味関心や教科の有用性についての意識が高いので今後も継続させていきたい。また、下位層の生徒へ基礎基本事項が徹底できるように、技能習熟させる取り組みが必要である。"]
[]
[]
[]
[]
[]
[]
[]
[]
[]
[]
[]
[]
[]
[]
[]
[]
[]
[null,"《チャートの特徴》",null,null,null,null,null,null,null,null,null,null,null,null,"《家庭・地域への働きかけ》"]
[null,"・教科の正答率が全国平均より僅かに上回っている。\n・教科への関心、主体的な学び、対話的な学び、生活・学習習慣と全項目で全国平均より高い数値を示している。\n・規範意識も全国平均よりも高い数値を示している。\n・自己有用感も全国平均よりも高い数値を示している。\n",null,null,null,null,null,null,null,null,null,null,null,null,"・学びに向かう態度、意識をしっかり持ち、自分を大切にしながら学んでいこうとしているので、基本的な技能が定着できるように、各自の課題に取り組んでください。"]

{"sheet":"計算根拠・グラフ参照用シート","index":3,"n_rows":21,"n_cols":5,"rows_kept":21,"cut":false,"hidden":true,"merged":[]}
["領域名","全国の値を１とした場合の本校の様子",null,"領域名","全国の値を１とした場合の本校の様子"]
["生活・学習習慣",{"$f":"'３年度　質問紙入力シート'!L3","v":1.25750300120048},null,"国語平均正答率",{"$f":"'３年度　平均正答率入力シート'!D4","v":1.0371517027863777}]
["自己有用感",{"$f":"'３年度　質問紙入力シート'!L7","v":1.3056768558951966},null,"算数平均正答率",{"$f":"'３年度　平均正答率入力シート'!D5","v":1.048951048951049}]
["規範意識",{"$f":"'３年度　質問紙入力シート'!L10","v":1.2813171080887618}]
["主体的な学び",{"$f":"'３年度　質問紙入力シート'!L13","v":1.1994669035984007}]
["対話的な学び",{"$f":"'３年度　質問紙入力シート'!L16","v":1.3504501500500168}]
["国語への関心",{"$f":"'３年度　質問紙入力シート'!L20","v":1.375}]
["算数への関心",{"$f":"'３年度　質問紙入力シート'!L28","v":1.2990320937340805}]
[]
[]
["グラフ参照用一覧"]
["領域名","全国","本校"]
["国語平均正答率",1,{"$f":"E2","v":1.0371517027863777}]
["算数平均正答率",1,{"$f":"E3","v":1.048951048951049}]
["生活・学習習慣",1,{"$f":"B2","v":1.25750300120048}]
["自己有用感",1,1.3056768558951966]
["規範意識",1,1.2813171080887618]
["主体的な学び",1,1.1994669035984007]
["対話的な学び",1,1.3504501500500168]
["国語への関心",1,1.375]
["算数への関心",1,1.2990320937340805]

{"sheet":"行政番号と学校名","index":4,"n_rows":103,"n_cols":2,"rows_kept":103,"cut":false,"hidden":true,"merged":[]}
[101,"江戸川区立小松川小学校"]
[102,"江戸川区立小松川第二小学校"]
[103,"江戸川区立平井小学校"]
[104,"江戸川区立平井西小学校"]
[105,"江戸川区立平井東小学校"]
[106,"江戸川区立平井南小学校"]
[107,"江戸川区立松江小学校"]
[108,"江戸川区立西一之江小学校"]
[109,"江戸川区立第二松江小学校"]
[110,"江戸川区立西小松川小学校"]
[111,"江戸川区立大杉小学校"]
[112,"江戸川区立大杉第二小学校"]
[113,"江戸川区立第三松江小学校"]
[114,"江戸川区立大杉東小学校"]
[115,"江戸川区立東小松川小学校"]
[116,"江戸川区立船堀小学校"]
[117,"江戸川区立船堀第二小学校"]
[118,"江戸川区立葛西小学校"]
[119,"江戸川区立二之江小学校"]
[120,"江戸川区立二之江第二小学校"]
[121,"江戸川区立二之江第三小学校"]
[122,"江戸川区立第二葛西小学校"]
[123,"江戸川区立第三葛西小学校"]
[124,"江戸川区立第四葛西小学校"]
[125,"江戸川区立第五葛西小学校"]
[126,"江戸川区立第六葛西小学校"]
[127,"江戸川区立第七葛西小学校"]
[128,"江戸川区立南葛西小学校"]
[129,"江戸川区立南葛西第二小学校"]
[130,"江戸川区立南葛西第三小学校"]
[131,"江戸川区立西葛西小学校"]
[132,"江戸川区立新田小学校"]
[133,"江戸川区立宇喜田小学校"]
[134,"江戸川区立清新第一小学校"]
[135,"江戸川区立清新ふたば小学校"]
[136,"江戸川区立臨海小学校"]
[137,"江戸川区立東葛西小学校"]
[138,"江戸川区立瑞江小学校"]
[139,"江戸川区立春江小学校"]
[140,"江戸川区立新堀小学校"]
[141,"江戸川区立下鎌田小学校"]
[142,"江戸川区立下鎌田東小学校"]
[143,"江戸川区立下鎌田西小学校"]
[144,"江戸川区立江戸川小学校"]
[145,"江戸川区立一之江小学校"]
[146,"江戸川区立一之江第二小学校"]
[147,"江戸川区立鹿本小学校"]
[148,"江戸川区立鹿骨小学校"]
[149,"江戸川区立鹿骨東小学校"]
[150,"江戸川区立松本小学校"]
[151,"江戸川区立本一色小学校"]
[152,"江戸川区立篠崎小学校"]
[153,"江戸川区立篠崎第二小学校"]
[154,"江戸川区立篠崎第三小学校"]
[155,"江戸川区立篠崎第四小学校"]
[156,"江戸川区立篠崎第五小学校"]
[157,"江戸川区立南篠崎小学校"]
[158,"江戸川区立鎌田小学校"]
[159,"江戸川区立小岩小学校"]
[160,"江戸川区立東小岩小学校"]
[161,"江戸川区立下小岩小学校"]
[162,"江戸川区立下小岩第二小学校"]
[163,"江戸川区立上小岩小学校"]
[164,"江戸川区立上小岩第二小学校"]
[165,"江戸川区立西小岩小学校"]
[166,"江戸川区立上一色南小学校"]
[167,"江戸川区立南小岩小学校"]
[168,"江戸川区立南小岩第二小学校"]
[169,"江戸川区立中小岩小学校"]
[170,"江戸川区立北小岩小学校"]
[201,"江戸川区立小松川第一中学校"]
[202,"江戸川区立小松川第二中学校"]
[203,"江戸川区立小松川第三中学校"]
[204,"江戸川区立松江第一中学校"]
[205,"江戸川区立松江第二中学校"]
[206,"江戸川区立松江第三中学校"]
[207,"江戸川区立松江第四中学校"]
[208,"江戸川区立松江第五中学校"]
[209,"江戸川区立松江第六中学校"]
[210,"江戸川区立二之江中学校"]
[211,"江戸川区立葛西中学校"]
[212,"江戸川区立葛西第二中学校"]
[213,"江戸川区立葛西第三中学校"]
[214,"江戸川区立南葛西中学校"]
[215,"江戸川区立南葛西第二中学校"]
[216,"江戸川区立西葛西中学校"]
[217,"江戸川区立東葛西中学校"]
[218,"江戸川区立清新第一中学校"]
[219,"江戸川区立清新第二中学校"]
[220,"江戸川区立瑞江中学校"]
[221,"江戸川区立瑞江第二中学校"]
[222,"江戸川区立瑞江第三中学校"]
[223,"江戸川区立春江中学校"]
[224,"江戸川区立鹿本中学校"]
[225,"江戸川区立鹿骨中学校"]
[226,"江戸川区立篠崎中学校"]
[227,"江戸川区立篠崎第二中学校"]
[228,"江戸川区立小岩第一中学校"]
[229,"江戸川区立小岩第二中学校"]
[230,"江戸川区立小岩第三中学校"]
[231,"江戸川区立小岩第四中学校"]
[232,"江戸川区立小岩第五中学校"]
[233,"江戸川区立上一色中学校"]

{"sheet":"学校番号","index":5,"n_rows":103,"n_cols":2,"rows_kept":103,"cut":false,"hidden":true,"merged":[]}
[101,"江戸川区立小松川小学校"]
[102,"江戸川区立小松川第二小学校"]
[103,"江戸川区立平井小学校"]
[104,"江戸川区立平井西小学校"]
[105,"江戸川区立平井東小学校"]
[106,"江戸川区立平井南小学校"]
[107,"江戸川区立松江小学校"]
[108,"江戸川区立西一之江小学校"]
[109,"江戸川区立第二松江小学校"]
[110,"江戸川区立西小松川小学校"]
[111,"江戸川区立大杉小学校"]
[112,"江戸川区立大杉第二小学校"]
[113,"江戸川区立第三松江小学校"]
[114,"江戸川区立大杉東小学校"]
[115,"江戸川区立東小松川小学校"]
[116,"江戸川区立船堀小学校"]
[117,"江戸川区立船堀第二小学校"]
[118,"江戸川区立葛西小学校"]
[119,"江戸川区立二之江小学校"]
[120,"江戸川区立二之江第二小学校"]
[121,"江戸川区立二之江第三小学校"]
[122,"江戸川区立第二葛西小学校"]
[123,"江戸川区立第三葛西小学校"]
[124,"江戸川区立第四葛西小学校"]
[125,"江戸川区立第五葛西小学校"]
[126,"江戸川区立第六葛西小学校"]
[127,"江戸川区立第七葛西小学校"]
[128,"江戸川区立南葛西小学校"]
[129,"江戸川区立南葛西第二小学校"]
[130,"江戸川区立南葛西第三小学校"]
[131,"江戸川区立西葛西小学校"]
[132,"江戸川区立新田小学校"]
[133,"江戸川区立宇喜田小学校"]
[134,"江戸川区立清新第一小学校"]
[135,"江戸川区立清新ふたば小学校"]
[136,"江戸川区立臨海小学校"]
[137,"江戸川区立東葛西小学校"]
[138,"江戸川区立瑞江小学校"]
[139,"江戸川区立春江小学校"]
[140,"江戸川区立新堀小学校"]
[141,"江戸川区立下鎌田小学校"]
[142,"江戸川区立下鎌田東小学校"]
[143,"江戸川区立下鎌田西小学校"]
[144,"江戸川区立江戸川小学校"]
[145,"江戸川区立一之江小学校"]
[146,"江戸川区立一之江第二小学校"]
[147,"江戸川区立鹿本小学校"]
[148,"江戸川区立鹿骨小学校"]
[149,"江戸川区立鹿骨東小学校"]
[150,"江戸川区立松本小学校"]
[151,"江戸川区立本一色小学校"]
[152,"江戸川区立篠崎小学校"]
[153,"江戸川区立篠崎第二小学校"]
[154,"江戸川区立篠崎第三小学校"]
[155,"江戸川区立篠崎第四小学校"]
[156,"江戸川区立篠崎第五小学校"]
[157,"江戸川区立南篠崎小学校"]
[158,"江戸川区立鎌田小学校"]
[159,"江戸川区立小岩小学校"]
[160,"江戸川区立東小岩小学校"]
[161,"江戸川区立下小岩小学校"]
[162,"江戸川区立下小岩第二小学校"]
[163,"江戸川区立上小岩小学校"]
[164,"江戸川区立上小岩第二小学校"]
[165,"江戸川区立西小岩小学校"]
[166,"江戸川区立上一色南小学校"]
[167,"江戸川区立南小岩小学校"]
[168,"江戸川区立南小岩第二小学校"]
[169,"江戸川区立中小岩小学校"]
[170,"江戸川区立北小岩小学校"]
[201,"江戸川区立小松川第一中学校"]
[202,"江戸川区立小松川第二中学校"]
[203,"江戸川区立小松川第三中学校"]
[204,"江戸川区立松江第一中学校"]
[205,"江戸川区立松江第二中学校"]
[206,"江戸川区立松江第三中学校"]
[207,"江戸川区立松江第四中学校"]
[208,"江戸川区立松江第五中学校"]
[209,"江戸川区立松江第六中学校"]
[210,"江戸川区立二之江中学校"]
[211,"江戸川区立葛西中学校"]
[212,"江戸川区立葛西第二中学校"]
[213,"江戸川区立葛西第三中学校"]
[214,"江戸川区立南葛西中学校"]
[215,"江戸川区立南葛西第二中学校"]
[216,"江戸川区立西葛西中学校"]
[217,"江戸川区立東葛西中学校"]
[218,"江戸川区立清新第一中学校"]
[219,"江戸川区立清新第二中学校"]
[220,"江戸川区立瑞江中学校"]
[221,"江戸川区立瑞江第二中学校"]
[222,"江戸川区立瑞江第三中学校"]
[223,"江戸川区立春江中学校"]
[224,"江戸川区立鹿本中学校"]
[225,"江戸川区立鹿骨中学校"]
[226,"江戸川区立篠崎中学校"]
[227,"江戸川区立篠崎第二中学校"]
[228,"江戸川区立小岩第一中学校"]
[229,"江戸川区立小岩第二中学校"]
[230,"江戸川区立小岩第三中学校"]
[231,"江戸川区立小岩第四中学校"]
[232,"江戸川区立小岩第五中学校"]
[233,"江戸川区立上一色中学校"]