{"text_format":"1","workbook":"xlsx","n_sheets":6,"sheets":["Ｒ６年度　平均正答率入力シート","Ｒ６年度　質問紙入力シート","６年度　結果分析表","計算根拠・グラフ参照用シート","行政番号と学校名","学校番号"],"not_rendered":{"charts":1,"images":0,"macros":1,"external_links":0,"defined_names":2,"comments":0,"pivot_tables":0},"unopened":[],"bounds":{"document_bytes":16777216,"sheet_cells":100000,"rows_first":2000,"rows_last":500,"rows_between":2000,"halvings":0,"cell_chars":16384,"cell_head_chars":4096},"cells_cut":0,"cells_raw":0,"read":"whole","date_system":"1900"}

{"sheet":"Ｒ６年度　平均正答率入力シート","index":0,"n_rows":5,"n_cols":4,"rows_kept":5,"cut":false,"hidden":false,"merged":[[0,2,0,3]]}
["行政番号（3ケタ）",123,{"$f":"VLOOKUP(B1,学校番号!A1:B66,2)","v":"江戸川区立第五葛西小学校"}]
[null,"※↑行政番号を入力して下さい。これ以降の学校名は自動で表記されます。"]
["領域名","全国平均正答率（％）（Ａ）","本校平均正答率（％）","（Ａ）を１とした場合の本校の様子"]
["国語",67.7,73,{"$f":"C4/B4","v":1.0782865583456425}]
["算数",63.4,66,{"$f":"C5/B5","v":1.0410094637223974}]

{"sheet":"Ｒ６年度　質問紙入力シート","index":1,"n_rows":27,"n_cols":12,"rows_kept":27,"cut":false,"hidden":false,"merged":[[6,0,8,0],[19,6,22,6],[9,0,11,0],[0,0,1,0],[0,1,1,1],[0,2,1,2],[0,6,1,6],[2,0,5,0],[0,10,1,10],[0,3,0,4],[0,7,0,8],[9,11,11,11],[9,6,11,6],[9,10,11,10],[0,11,1,11],[2,11,5,11],[6,11,8,11],[2,10,5,10],[6,10,8,10],[2,6,5,6],[6,6,8,6],[19,10,22,10],[19,0,22,0],[19,11,22,11],[23,11,26,11],[23,6,26,6],[23,10,26,10],[23,0,26,0],[15,11,18,11],[12,11,14,11],[12,0,14,0],[15,0,18,0],[12,6,14,6],[15,6,18,6],[12,10,14,10],[15,10,18,10]]}
["領域名","問番号","質問内容","全国肯定的回答",null,"全国　\n肯定的回答（小計）","全国\n肯定的回答（合計）\n（Ｂ）","本校肯定的回答",null,"本校\n肯定的回答（小計）","本校\n肯定的回答（合計）","（Ｂ）を１とした場合の本校の様子"]
[null,null,null,1,2,"1+2",null,1,2,"1+2"]
["基本的生活習慣","（1）","朝食を毎日食べていますか",83.4,10.3,{"$f":"D3+E3","v":93.7},{"$f":"SUM(F3:F6)","v":350.50000000000006},82.4,11.8,{"$f":"H3+I3","v":94.2},{"$f":"SUM(J3:J6)","v":359.1},{"$f":"K3/G3","v":1.0245363766048501}]
[null,"（2）","毎日、同じくらいの時刻に寝ていますか",39.700000000000003,43.2,82.9,null,50.6,31.8,{"$f":"H4+I4","v":82.4}]
[null,"（3）","毎日、同じくらいの時刻に起きていますか",56.1,35.5,91.6,null,70.599999999999994,22.4,{"$f":"H5+I5","v":93}]
[null,"(8)","健康にすごすために、授業で学習したことや保健室の先生などから教えられたことを、普段の生活に役立てていますか",34.5,47.8,82.3,null,47.1,42.4,89.5]
["自己有用感","(9)","自分には、よいところがあると思いますか",43.4,40.700000000000003,84.1,{"$f":"SUM(F7:F9)","v":256.39999999999998},58.8,25.9,84.699999999999989,{"$f":"SUM(J7:J9)","v":259.89999999999998},{"$f":"K7/G7","v":1.0136505460218408}]
[null,"(10)","先生は、あなたのよいところを認めてくれていると思いますか",48.8,41.1,89.9,null,63.5,28.2,{"$f":"H8+I8","v":91.7}]
[null,"(11)","将来の夢や目標を持っていますか",60.6,21.8,82.4,null,65.900000000000006,17.600000000000001,83.5]
["規範意識","(12)","人が困っているときは、進んで助けていますか",46,46.7,92.7,{"$f":"SUM(F10:F12)","v":285.3},61.2,34.1,95.300000000000011,{"$f":"SUM(J10:J12)","v":288.3},{"$f":"K10/G10","v":1.010515247108307}]
[null,"(13)","いじめは、どんな理由があってもいけないことだと思いますか",79.5,17.2,96.7,null,87.1,10.6,97.699999999999989]
[null,"(15)","人の役に立つ人間になりたいと思いますか",71.099999999999994,24.8,95.899999999999991,null,68.2,27.1,95.300000000000011]
["主体的な学び","(29)","５年生までに受けた授業で、自分の考えを発表する機会では、自分の考えがうまく伝わるよう、資料や文章、話の組立てなどを工夫して発表していましたか",25.9,41.7,67.599999999999994,{"$f":"SUM(F13:F15)","v":229.1},34.1,41.2,75.300000000000011,{"$f":"SUM(J13:J15)","v":240},{"$f":"K13/G13","v":1.0475774770842428}]
[null,"(30)","５年生までに受けた授業では、課題の解決に向けて、自分で考え、自分から取り組んでいましたか",29.5,52.4,81.900000000000006,null,37.6,45.9,83.5]
[null,"(31)","５年生までに受けた授業では、各教科などで学んだことを生かしながら、自分の考えをまとめる活動を行っていましたか",29.7,49.9,{"$f":"D15+E15","v":79.599999999999994},null,36.5,44.7,81.2]
["対話的な学び","(33)","学級の友達との間で話し合う活動を通じて、自分の考えを深めたり、新たな考え方に気付いたりすることができていますか",41.4,44.9,{"$f":"D16+E16","v":86.3},{"$f":"SUM(F16:F19)","v":341.2},54.1,38.799999999999997,92.9,{"$f":"SUM(J16:J19)","v":357.4},{"$f":"K16/G16","v":1.0474794841735053}]
[null,"(39)","あなたの学級では、学級生活をよりよくするために学級会で話し合い、互いの意見のよさを生かして解決方法を決めていますか",36.299999999999997,47.9,{"$f":"D17+E17","v":84.199999999999989},null,48.2,38.799999999999997,87]
[null,"(40)","学級活動における学級での話合いを生かして、今、自分が努力すべきことを決めて取り組んでいますか",34.9,47.6,{"$f":"D18+E18","v":82.5},null,52.9,32.9,85.8]
[null,"(41)","道徳の授業では、自分の考えを深めたり、学級やグループで話し合ったりする活動に取り組んでいますか",47.3,40.9,{"$f":"D19+E19","v":88.199999999999989},null,48.2,43.5,91.7]
["国語への関心","(42)","国語の勉強は好きですか",24.1,37.9,62,{"$f":"SUM(F20:F23)","v":336},29.4,34.1,{"$f":"H20+I20","v":63.5},{"$f":"SUM(J20:J23)","v":350.6},{"$f":"K20/G20","v":1.043452380952381}]
[null,"(43)","国語の勉強は大切だと思いますか",67.5,27,94.5,null,84.7,29.4,{"$f":"H21+I21","v":114.1}]
[null,"(44)","国語の授業の内容はよく分かりますか",39.200000000000003,47.1,86.300000000000011,null,44.7,40,84.7]
[null,"(45)","国語の授業で学習したことは、将来、社会に出たときに役に立つと思いますか",61.8,31.4,93.199999999999989,null,65.900000000000006,22.4,88.300000000000011]
["算数への関心","(50)","算数の勉強は好きですか",34,27,{"$f":"D24+E24","v":61},{"$f":"SUM(F24:F27)","v":331.79999999999995},40,21.2,61.2,{"$f":"SUM(J24:J27)","v":343.1},{"$f":"K24/G24","v":1.0340566606389394}]
[null,"(51)","算数の勉強は大切だと思いますか",74.3,20.3,{"$f":"D25+E25","v":94.6},null,78.5,20,98.5]
[null,"(52)","算数の授業の内容はよく分かりますか",44.9,37.200000000000003,{"$f":"D26+E26","v":82.1},null,49.4,37.6,87]
[null,"(53)","算数の授業で学習したことは、将来、社会に出たときに役に立つと思いますか",71.7,22.4,{"$f":"D27+E27","v":94.1},null,78.8,17.600000000000001,{"$f":"H27+I27","v":96.4}]

{"sheet":"６年度　結果分析表","index":2,"n_rows":39,"n_cols":16,"rows_kept":39,"cut":false,"hidden":false,"merged":[[38,14,44,18],[19,14,35,18],[5,14,16,18],[38,1,44,12]]}
[]
[null,"令和６年度 全国学力・学習状況調査結果における課題分析表（小学校）",null,null,null,null,null,null,null,null,null,null,null,null,null,{"$f":"VLOOKUP('Ｒ６年度　平均正答率入力シート'!B1,学校番号!A1:B69,2)","v":"江戸川区立第五葛西小学校"}]
[]
[]
[null,"●各領域における、全国平均正答率及び、全国の肯定的回答合計値を基準とした場合の、本校の様子。",null,null,null,null,null,null,null,null,null,null,null,null,"《現状把握》"]
[null,null,null,null,null,null,null,null,null,null,null,null,null,null,"・国語も算数も平均正答率が江戸川区平均を上回った。国語は、漢字を正しい使い方に書き直したり、主語と述語の関係を捉えたりする問題では、平均を下回っており、「言葉の特徴や使い方に関する事項」を苦手としている児童が多い。算数は、円柱や球と言った立体についての理解に関する問題の正答率が低く、「Ｂ図形」の定着が十分とは言えない現状であると捉えている。\n・生活、学習習慣が全国平均よりも高いということから、規則正しい生活習慣を心掛け、学習習慣も引き続き身に付いている状況が続いていると考えられる。"]
[]
[]
[]
[]
[]
[]
[]
[]
[]
[]
[]
[]
[null,null,null,null,null,null,null,null,null,null,null,null,null,null,"《授業改善のポイント》"]
[null,null,null,null,null,null,null,null,null,null,null,null,null,null,"＜国語＞\n・読解する際に様々な文章に触れる中で、主語と述語の役割を理解しながら読み進めたり、繰り返し関係を捉える練習をしたりすることで、文の構造への興味関心を高めさせていく。\n・言語事項の単元の時数を十分に設定し、習得できるようにする。\n＜算数＞\n・実物、模型、デジタル教材などを効果的に活用し、知識だけでなく、視覚的に体験的に理解を深める活動を設定し、立体図形の見方を養う。"]
[]
[]
[]
[]
[]
[]
[]
[]
[]
[]
[]
[]
[]
[]
[]
[]
[]
[null,"《チャートの特徴》",null,null,null,null,null,null,null,null,null,null,null,null,"《家庭・地域への働きかけ》"]
[null,"今年度の学力調査の結果、国語は5.3％、算数は2.6％、全国の平均正答率を上回った。基礎的学力や知識が概ね身に付き、意欲的に学習していることが分かった。\n質問調査では、すべての数値において、全国値と同率、もしくは上回っており、充実した学校生活を送ることができている。また、学びに対する意欲を表す、「主体的な学び」や「対話的な学び」では肯定的意見が８割程度と高い。本校の学習活動の工夫や特色ある教育活動の効果が表れているため、継続して多彩な教育活動を計画し、質の高い学習活動を実現していくため、教員の授業力向上に力を入れていく。",null,null,null,null,null,null,null,null,null,null,null,null,"・学力調査や個々の学習カルテを通して、児童の実態を把握し補習を行ったり、授業改善を行うと共に、家庭にも情報を提供し、連携を図る。\n・「江戸川っ子study week」を設定して家庭でもミライシードを活用した復習への取り組みを働きかける。\n・アクションプランで自分の課題を見付けて取り組む機会を設ける。\n・学年便りや学校ホームページを活用して学校の取組や成果を公表するとともに、学習や生活環境の向上への理解を図る。"]

{"sheet":"計算根拠・グラフ参照用シート","index":3,"n_rows":21,"n_cols":5,"rows_kept":21,"cut":false,"hidden":true,"merged":[]}
["領域名","全国の値を１とした場合の本校の様子",null,"領域名","全国の値を１とした場合の本校の様子"]
["基本的生活習慣",{"$f":"'Ｒ６年度　質問紙入力シート'!L3","v":1.0245363766048501},null,"国語平均正答率",{"$f":"'Ｒ６年度　平均正答率入力シート'!D4","v":1.0782865583456425}]
["自己有用感",{"$f":"'Ｒ６年度　質問紙入力シート'!L7","v":1.0136505460218408},null,"算数平均正答率",{"$f":"'Ｒ６年度　平均正答率入力シート'!D5","v":1.0410094637223974}]
["規範意識",{"$f":"'Ｒ６年度　質問紙入力シート'!L10","v":1.010515247108307}]
["主体的な学び",{"$f":"'Ｒ６年度　質問紙入力シート'!L13","v":1.0475774770842428}]
["対話的な学び",{"$f":"'Ｒ６年度　質問紙入力シート'!L16","v":1.0474794841735053}]
["国語への関心",{"$f":"'Ｒ６年度　質問紙入力シート'!L20","v":1.043452380952381}]
["算数への関心",{"$f":"'Ｒ６年度　質問紙入力シート'!L24","v":1.0340566606389394}]
[]
[]
["グラフ参照用一覧"]
["領域名","全国","本校"]
["国語平均正答率",1,{"$f":"E2","v":1.0782865583456425}]
["算数平均正答率",1,{"$f":"E3","v":1.0410094637223974}]
["基本的生活習慣",1,{"$f":"B2","v":1.0245363766048501}]
["自己有用感",1,1.0136505460218408]
["規範意識",1,1.010515247108307]
["主体的な学び",1,1.0475774770842428]
["対話的な学び",1,1.0474794841735053]
["国語への関心",1,1.043452380952381]
["算数への関心",1,1.0340566606389394]

{"sheet":"行政番号と学校名","index":4,"n_rows":98,"n_cols":2,"rows_kept":98,"cut":false,"hidden":true,"merged":[]}
[101,"江戸川区立小松川小学校"]
[102,"江戸川区立小松川第二小学校"]
[103,"江戸川区立平井小学校"]
[104,"江戸川区立平井西小学校"]
[105,"江戸川区立平井東小学校"]
[106,"江戸川区立平井南小学校"]
[107,"江戸川区立松江小学校"]
[108,"江戸川区立西一之江小学校"]
[109,"江戸川区立西小松川小学校"]
[110,"江戸川区立大杉小学校"]
[111,"江戸川区立大杉第二小学校"]
[112,"江戸川区立第三松江小学校"]
[113,"江戸川区立大杉東小学校"]
[114,"江戸川区立東小松川小学校"]
[115,"江戸川区立船堀小学校"]
[116,"江戸川区立船堀第二小学校"]
[117,"江戸川区立葛西小学校"]
[118,"江戸川区立二之江小学校"]
[119,"江戸川区立二之江第二小学校"]
[120,"江戸川区立第二葛西小学校"]
[121,"江戸川区立第三葛西小学校"]
[122,"江戸川区立第四葛西小学校"]
[123,"江戸川区立第五葛西小学校"]
[124,"江戸川区立第六葛西小学校"]
[125,"江戸川区立第七葛西小学校"]
[126,"江戸川区立南葛西小学校"]
[127,"江戸川区立南葛西第二小学校"]
[128,"江戸川区立南葛西第三小学校"]
[129,"江戸川区立西葛西小学校"]
[130,"江戸川区立新田小学校"]
[131,"江戸川区立宇喜田小学校"]
[132,"江戸川区立清新第一小学校"]
[133,"江戸川区立清新ふたば小学校"]
[134,"江戸川区立臨海小学校"]
[135,"江戸川区立東葛西小学校"]
[136,"江戸川区立瑞江小学校"]
[137,"江戸川区立春江小学校"]
[138,"江戸川区立新堀小学校"]
[139,"江戸川区立下鎌田小学校"]
[140,"江戸川区立下鎌田東小学校"]
[141,"江戸川区立江戸川小学校"]
[142,"江戸川区立一之江小学校"]
[143,"江戸川区立一之江第二小学校"]
[144,"江戸川区立鹿本小学校"]
[145,"江戸川区立鹿骨小学校"]
[146,"江戸川区立鹿骨東小学校"]
[147,"江戸川区立松本小学校"]
[148,"江戸川区立本一色小学校"]
[149,"江戸川区立篠崎小学校"]
[150,"江戸川区立篠崎第二小学校"]
[151,"江戸川区立篠崎第三小学校"]
[152,"江戸川区立篠崎第四小学校"]
[153,"江戸川区立篠崎第五小学校"]
[154,"江戸川区立南篠崎小学校"]
[155,"江戸川区立鎌田小学校"]
[156,"江戸川区立小岩小学校"]
[157,"江戸川区立東小岩小学校"]
[158,"江戸川区立下小岩小学校"]
[159,"江戸川区立上小岩小学校"]
[160,"江戸川区立上小岩第二小学校"]
[161,"江戸川区立西小岩小学校"]
[162,"江戸川区立上一色南小学校"]
[163,"江戸川区立南小岩小学校"]
[164,"江戸川区立南小岩第二小学校"]
[165,"江戸川区立中小岩小学校"]
[166,"江戸川区立北小岩小学校"]
[201,"江戸川区立小松川中学校"]
[202,"江戸川区立小松川第二中学校"]
[203,"江戸川区立松江第一中学校"]
[204,"江戸川区立松江第二中学校"]
[205,"江戸川区立松江第三中学校"]
[206,"江戸川区立松江第四中学校"]
[207,"江戸川区立松江第五中学校"]
[208,"江戸川区立松江第六中学校"]
[209,"江戸川区立二之江中学校"]
[210,"江戸川区立葛西中学校"]
[211,"江戸川区立葛西第二中学校"]
[212,"江戸川区立葛西第三中学校"]
[213,"江戸川区立南葛西中学校"]
[214,"江戸川区立南葛西第二中学校"]
[215,"江戸川区立西葛西中学校"]
[216,"江戸川区立東葛西中学校"]
[217,"江戸川区立清新第一中学校"]
[218,"江戸川区立清新第二中学校"]
[219,"江戸川区立瑞江中学校"]
[220,"江戸川区立瑞江第二中学校"]
[221,"江戸川区立瑞江第三中学校"]
[222,"江戸川区立春江中学校"]
[223,"江戸川区立鹿本中学校"]
[224,"江戸川区立鹿骨中学校"]
[225,"江戸川区立篠崎中学校"]
[226,"江戸川区立篠崎第二中学校"]
[227,"江戸川区立小岩第一中学校"]
[228,"江戸川区立小岩第二中学校"]
[229,"江戸川区立小岩第三中学校"]
[230,"江戸川区立小岩第四中学校"]
[231,"江戸川区立小岩第五中学校"]
[232,"江戸川区立上一色中学校"]

{"sheet":"学校番号","index":5,"n_rows":98,"n_cols":2,"rows_kept":98,"cut":false,"hidden":true,"merged":[]}
[101,"江戸川区立小松川小学校"]
[102,"江戸川区立小松川第二小学校"]
[103,"江戸川区立平井小学校"]
[104,"江戸川区立平井西小学校"]
[105,"江戸川区立平井東小学校"]
[106,"江戸川区立平井南小学校"]
[107,"江戸川区立松江小学校"]
[108,"江戸川区立西一之江小学校"]
[109,"江戸川区立西小松川小学校"]
[110,"江戸川区立大杉小学校"]
[111,"江戸川区立大杉第二小学校"]
[112,"江戸川区立第三松江小学校"]
[113,"江戸川区立大杉東小学校"]
[114,"江戸川区立東小松川小学校"]
[115,"江戸川区立船堀小学校"]
[116,"江戸川区立船堀第二小学校"]
[117,"江戸川区立葛西小学校"]
[118,"江戸川区立二之江小学校"]
[119,"江戸川区立二之江第二小学校"]
[120,"江戸川区立第二葛西小学校"]
[121,"江戸川区立第三葛西小学校"]
[122,"江戸川区立第四葛西小学校"]
[123,"江戸川区立第五葛西小学校"]
[124,"江戸川区立第六葛西小学校"]
[125,"江戸川区立第七葛西小学校"]
[126,"江戸川区立南葛西小学校"]
[127,"江戸川区立南葛西第二小学校"]
[128,"江戸川区立南葛西第三小学校"]
[129,"江戸川区立西葛西小学校"]
[130,"江戸川区立新田小学校"]
[131,"江戸川区立宇喜田小学校"]
[132,"江戸川区立清新第一小学校"]
[133,"江戸川区立清新ふたば小学校"]
[134,"江戸川区立臨海小学校"]
[135,"江戸川区立東葛西小学校"]
[136,"江戸川区立瑞江小学校"]
[137,"江戸川区立春江小学校"]
[138,"江戸川区立新堀小学校"]
[139,"江戸川区立下鎌田小学校"]
[140,"江戸川区立下鎌田東小学校"]
[141,"江戸川区立江戸川小学校"]
[142,"江戸川区立一之江小学校"]
[143,"江戸川区立一之江第二小学校"]
[144,"江戸川区立鹿本小学校"]
[145,"江戸川区立鹿骨小学校"]
[146,"江戸川区立鹿骨東小学校"]
[147,"江戸川区立松本小学校"]
[148,"江戸川区立本一色小学校"]
[149,"江戸川区立篠崎小学校"]
[150,"江戸川区立篠崎第二小学校"]
[151,"江戸川区立篠崎第三小学校"]
[152,"江戸川区立篠崎第四小学校"]
[153,"江戸川区立篠崎第五小学校"]
[154,"江戸川区立南篠崎小学校"]
[155,"江戸川区立鎌田小学校"]
[156,"江戸川区立小岩小学校"]
[157,"江戸川区立東小岩小学校"]
[158,"江戸川区立下小岩小学校"]
[159,"江戸川区立上小岩小学校"]
[160,"江戸川区立上小岩第二小学校"]
[161,"江戸川区立西小岩小学校"]
[162,"江戸川区立上一色南小学校"]
[163,"江戸川区立南小岩小学校"]
[164,"江戸川区立南小岩第二小学校"]
[165,"江戸川区立中小岩小学校"]
[166,"江戸川区立北小岩小学校"]
[201,"江戸川区立小松川中学校"]
[202,"江戸川区立小松川第二中学校"]
[203,"江戸川区立松江第一中学校"]
[204,"江戸川区立松江第二中学校"]
[205,"江戸川区立松江第三中学校"]
[206,"江戸川区立松江第四中学校"]
[207,"江戸川区立松江第五中学校"]
[208,"江戸川区立松江第六中学校"]
[209,"江戸川区立二之江中学校"]
[210,"江戸川区立葛西中学校"]
[211,"江戸川区立葛西第二中学校"]
[212,"江戸川区立葛西第三中学校"]
[213,"江戸川区立南葛西中学校"]
[214,"江戸川区立南葛西第二中学校"]
[215,"江戸川区立西葛西中学校"]
[216,"江戸川区立東葛西中学校"]
[217,"江戸川区立清新第一中学校"]
[218,"江戸川区立清新第二中学校"]
[219,"江戸川区立瑞江中学校"]
[220,"江戸川区立瑞江第二中学校"]
[221,"江戸川区立瑞江第三中学校"]
[222,"江戸川区立春江中学校"]
[223,"江戸川区立鹿本中学校"]
[224,"江戸川区立鹿骨中学校"]
[225,"江戸川区立篠崎中学校"]
[226,"江戸川区立篠崎第二中学校"]
[227,"江戸川区立小岩第一中学校"]
[228,"江戸川区立小岩第二中学校"]
[229,"江戸川区立小岩第三中学校"]
[230,"江戸川区立小岩第四中学校"]
[231,"江戸川区立小岩第五中学校"]
[232,"江戸川区立上一色中学校"]